{"text_format":"1","workbook":"xlsx","n_sheets":11,"sheets":["手順書_はじめに","自動生成_地図データ","CHANGELOG","地図テンプレート_1","市町村データ","手順書_市町村なまえ","自動生成_市町村なまえ","手順書_人口密度","自動生成_人口密度","手順書_人口","自動生成_人口"],"not_rendered":{"charts":0,"images":9,"macros":1,"external_links":0,"defined_names":1,"comments":0,"pivot_tables":0},"unopened":[],"bounds":{"document_bytes":16777216,"sheet_cells":100000,"rows_first":2000,"rows_last":500,"rows_between":2000,"halvings":0,"cell_chars":16384,"cell_head_chars":4096},"cells_cut":0,"cells_raw":0,"read":"whole","date_system":"1900"}

{"sheet":"手順書_はじめに","index":0,"n_rows":144,"n_cols":32,"rows_kept":144,"cut":false,"hidden":false,"merged":[[61,6,61,15],[61,17,61,20],[59,6,59,15],[59,17,59,20],[63,6,63,15],[63,17,63,20],[65,6,65,15],[65,17,65,20],[67,6,67,15],[67,17,67,20],[69,6,69,15],[69,17,69,20],[77,6,77,15],[77,17,77,20],[71,6,71,15],[71,17,71,20],[73,6,73,15],[73,17,73,20],[75,6,75,15],[75,17,75,20]]}
[null,null,null,null,null,null,"C1.0",null,null,null,null,null,null,null,null,null,null,"C2.0",null,null,null,null,null,null,null,null,null,null,null,null,null,"EOL"]
[null,"ヒートマップ 3.0.1　＞　手順書　＞　はじめに"]
[]
[null,null,null,"このワークブックは？"]
[]
[]
[]
[]
{"$rows_left_out":137}
{"sheet":"自動生成_地図データ","index":1,"n_rows":48,"n_cols":2,"rows_kept":48,"cut":false,"hidden":false,"merged":[]}
["InformalCityId","セル"]
[1,"BO7"]
[11,"BC11"]
[7,"BG11"]
[4,"BK11"]
[2,"BO11"]
[35,"S15"]
[31,"W15"]
{"$rows_left_out":41}
{"sheet":"CHANGELOG","index":2,"n_rows":2,"n_cols":4,"rows_kept":2,"cut":false,"hidden":false,"merged":[]}
["日付","バージョン","操作","概要"]
["2025-06-10T06:52:00","3.0.1","Changed","3.0.0 から［市町村データ］ワークシートの最終行を読み込まなくなっていた不具合を修正。\n［地図テンプレート］には市町村名も振るように運用を変更。"]

{"sheet":"地図テンプレート_1","index":3,"n_rows":41,"n_cols":71,"rows_kept":41,"cut":false,"hidden":false,"merged":[[17,38,17,41],[14,67,14,69],[15,18,15,21],[16,18,16,21],[17,18,17,21],[15,22,15,25],[16,22,16,25],[17,22,17,25],[15,66,15,69],[16,66,16,69],[17,66,17,69],[15,30,15,33],[16,30,16,33],[17,30,17,33],[15,54,15,57],[15,58,15,61],[14,19,14,21],[14,23,14,25],[14,31,14,33],[14,35,14,37],[14,39,14,41],[14,43,14,45],[20,42,20,45],[21,42,21,45],[18,43,18,45],[18,47,18,49],[18,51,18,53],[18,55,18,57],[18,59,18,61],[18,63,18,65],[19,54,19,57],[20,54,20,57],[21,54,21,57],[19,58,19,61],[20,58,20,61],[22,7,22,9],[23,6,23,9],[24,6,24,9],[25,6,25,9],[22,19,22,21],[23,18,23,21],[24,18,24,21],[25,18,25,21],[21,22,21,25],[22,11,22,13],[22,23,22,25],[23,10,23,13],[23,22,23,25],[24,10,24,13],[24,22,24,25],[25,10,25,13],[25,22,25,25],[21,10,21,13],[21,14,21,17],[22,31,22,33],[22,39,22,41],[22,47,22,49],[22,51,22,53],[22,55,22,57],[22,59,22,61],[22,43,22,45],[19,62,19,65],[20,62,20,65],[21,62,21,65],[19,46,19,49],[20,46,20,49],[21,46,21,49],[19,50,19,53],[20,50,20,53],[21,50,21,53],[21,58,21,61],[19,34,19,37],[20,34,20,37],[21,34,21,37],[19,38,19,41],[20,38,20,41],[21,38,21,41],[19,42,19,45],[23,30,23,33],[24,30,24,33],[25,30,25,33],[23,38,23,41],[24,38,24,41],[25,38,25,41],[23,58,23,61],[24,58,24,61],[25,58,25,61],[25,54,25,57],[23,42,23,45],[24,42,24,45],[25,42,25,45],[23,50,23,53],[24,50,24,53],[25,50,25,53],[23,46,23,49],[24,46,24,49],[25,46,25,49],[23,54,23,57],[24,54,24,57],[6,67,6,69],[7,66,7,69],[8,66,8,69],[9,66,9,69],[10,55,10,57],[10,59,10,61],[10,63,10,65],[10,67,10,69],[11,54,11,57],[11,58,11,61],[11,62,11,65],[11,66,11,69],[12,54,12,57],[12,58,12,61],[12,62,12,65],[12,66,12,69],[13,54,13,57],[13,58,13,61],[13,62,13,65],[13,66,13,69],[14,55,14,57],[14,59,14,61],[14,63,14,65],[15,62,15,65],[16,54,16,57],[16,58,16,61],[16,62,16,65],[17,54,17,57],[17,58,17,61],[17,62,17,65],[18,7,18,9],[18,19,18,21],[18,31,18,33],[18,35,18,37],[18,15,18,17],[18,11,18,13],[18,23,18,25],[18,27,18,29],[18,39,18,41],[15,42,15,45],[16,42,16,45],[17,42,17,45],[15,34,15,37],[16,34,16,37],[17,34,17,37],[15,38,15,41],[16,38,16,41],[19,6,19,9],[19,18,19,21],[19,30,19,33],[20,6,20,9],[20,18,20,21],[20,30,20,33],[21,6,21,9],[21,18,21,21],[21,30,21,33],[21,26,21,29],[19,10,19,13],[20,10,20,13],[19,14,19,17],[20,14,20,17],[19,22,19,25],[20,22,20,25],[19,26,19,29],[20,26,20,29],[31,6,31,9],[31,10,31,13],[32,6,32,9],[32,10,32,13],[33,6,33,9],[33,10,33,13],[26,11,26,13],[26,23,26,25],[27,10,27,13],[27,22,27,25],[28,10,28,13],[28,22,28,25],[29,10,29,13],[29,22,29,25],[30,7,30,9],[30,11,30,13],[26,7,26,9],[27,6,27,9],[28,6,28,9],[29,6,29,9],[26,19,26,21],[27,18,27,21],[28,18,28,21],[29,18,29,21]]}
[]
[]
[null,null,null,null,null,null,"あ",null,null,null,"い",null,null,null,"う",null,null,null,"え",null,null,null,"お",null,null,null,"か",null,null,null,"き",null,null,null,"く",null,null,null,"け",null,null,null,"こ",null,null,null,"さ",null,null,null,"し",null,null,null,"す",null,null,null,"せ",null,null,null,"そ",null,null,null,"た",null,null,null,"ち"]
[]
[]
[]
[null,null,"A",null,null,null,null,null,null,null,null,null,null,null,null,null,null,null,null,null,null,null,null,null,null,null,null,null,null,null,null,null,null,null,null,null,null,null,null,null,null,null,null,null,null,null,null,null,null,null,null,null,null,null,null,null,null,null,null,null,null,null,null,null,null,null,1,"北海道"]
[]
{"$rows_left_out":34}
{"sheet":"市町村データ","index":4,"n_rows":48,"n_cols":50,"rows_kept":48,"cut":false,"hidden":false,"merged":[]}
["InformalCityId","都道府県・市区町村名","名前","なまえ","都道府県・市区町村名（英語）","人口（人）","男（人）","女（人）","2015年（平成27年）の人口（組替）（人）","5年間の人口増減数（人）","5年間の人口増減率（％）","面積（km2）","人口密度（人/km2）","平均年齢（歳）","年齢中位数（歳）","15歳未満（人）","15～64歳（人）","65歳以上（人）","15歳未満（％）","15～64歳（％）","65歳以上（％）","15歳未満（人）","15～64歳（人）","65歳以上（人）","15歳未満（％）","15～64歳（％）","65歳以上（％）","15歳未満（人）","15～64歳（人）","65歳以上（人）","15歳未満（％）","15～64歳（％）","65歳以上（％）","人口性比","日本人（人）","外国人（人）","総世帯（世帯）","一般世帯（世帯）","施設等の世帯（世帯）","2015年（平成27年）の世帯数（組替）（世帯）","一般世帯（世帯）","うち核家族世帯（世帯）","夫婦のみの世帯（世帯）","夫婦と子供から成る世帯（世帯）","男親と子供から成る世帯（世帯）","女親と子供から成る世帯（世帯）","うち単独世帯（世帯）","うち65歳以上の単独世帯（世帯）","（再掲）夫65歳以上，妻60歳以上の夫婦のみの世帯（世帯）","（再掲）3世代世帯（世帯）"]
[1,"01000_北海道","北海道","ほっかいどう","Hokkaido",5224614,2465088,2759526,5381733,-157119,-2.9194900000000001,83424.44,66.599999999999994,49.782380000000003,51.342840000000002,556526,2988800,1679288,10.651999999999999,57.206139999999998,32.141860000000001,284897,1477750,702441,11.55728,59.947150000000001,28.49558,271629,1511050,976847,9.8433200000000003,54.75759,35.399090000000001,89.330119999999994,5188441,36173,2476846,2469063,7783,2444810,2469063,1324406,584819,511571,29921,198095,999825,361735,345741,59601]
[2,"02000_青森県","青森","あおもり","Aomori-ken",1237984,583402,654582,1308265,-70281,-5.3720800000000004,9645.64,128.30000000000001,50.82694,53.353180000000002,130259,689910,417815,10.52186,55.72851,33.749630000000003,66483,345000,171919,11.39574,59.135899999999999,29.468360000000001,63776,344910,245896,9.7430099999999999,52.69164,37.565350000000002,89.125879999999995,1232227,5757,511526,509649,1877,510945,509649,268760,100962,109399,7734,50665,168917,71752,60995,42895]
[3,"03000_岩手県","岩手","いわて","Iwate-ken",1210534,582952,627582,1279594,-69060,-5.3970200000000004,15275.01,79.2,50.58634,52.862119999999997,132735,670784,407015,10.965,55.412239999999997,33.62276,67919,342813,172220,11.650869999999999,58.80639,29.542739999999998,64816,327971,234795,10.32789,52.25947,37.412640000000003,92.888580000000005,1203203,7331,492436,490828,1608,493049,490828,252005,94910,105474,7549,44072,163290,62424,57656,46934]
[5,"04000_宮城県","宮城","みやぎ","Miyagi-ken",2301996,1122598,1179398,2333899,-31903,-1.36694,7282.29,316.10000000000002,47.426729999999999,48.133670000000002,268931,1385425,647640,11.682510000000001,60.183639999999997,28.133849999999999,137916,701792,282890,12.28543,62.514989999999997,25.199580000000001,131015,683633,364750,11.10863,57.964570000000002,30.92679,95.183980000000005,2280203,21793,982523,980549,1974,944720,980549,507063,181038,234787,13068,78170,362255,97239,102638,67505]
[4,"05000_秋田県","秋田","あきた","Akita-ken",959502,452439,507063,1023119,-63617,-6.2179500000000001,11637.52,82.4,52.899279999999997,56.449660000000002,92855,506960,359687,9.6774199999999997,52.835740000000001,37.486840000000001,47526,255856,149057,10.5044,56.55039,32.945210000000003,45329,251104,210630,8.9395199999999999,49.521259999999998,41.53922,89.227369999999993,955659,3843,385187,383531,1656,388560,383531,203177,81772,81097,5755,34553,117169,55437,52719,39453]
[7,"06000_山形県","山形","やまがた","Yamagata-ken",1068027,516438,551589,1123891,-55864,-4.9705899999999996,9323.15,114.6,50.484909999999999,52.824240000000003,120271,586578,361178,11.261039999999999,54.92165,33.817309999999999,61700,298506,156232,11.94722,57.800939999999997,30.251840000000001,58571,288072,204946,10.618589999999999,52.225839999999998,37.155560000000001,93.627319999999997,1060586,7441,398015,396792,1223,393396,396792,202342,75330,89321,5814,31877,112791,43451,47618,55238]
[8,"07000_福島県","福島","ふくしま","Fukushima-ken",1833152,903864,929288,1914039,-80887,-4.2259799999999998,13784.14,133,49.522860000000001,51.532330000000002,206993,1045887,580272,11.291639999999999,57.054020000000001,31.654330000000002,105826,543951,254087,11.70818,60.180619999999998,28.1112,101167,501936,326185,10.886509999999999,54.01296,35.100529999999999,97.264139999999998,1819085,14067,742911,740089,2822,737598,740089,384082,142632,168068,11393,61989,245335,87168,86303,69042]
{"$rows_left_out":41}
{"sheet":"手順書_市町村なまえ","index":5,"n_rows":117,"n_cols":32,"rows_kept":117,"cut":false,"hidden":false,"merged":[[54,6,54,9],[15,16,15,19],[67,16,67,19],[64,16,64,17],[15,5,15,14],[30,5,30,14],[51,7,51,9],[52,6,52,9],[53,6,53,9],[64,7,64,9],[64,10,64,11],[64,12,64,13],[30,16,30,17],[65,7,65,9],[65,10,65,11],[65,12,65,13],[66,7,66,9],[66,10,66,11],[66,12,66,13],[67,7,67,9],[67,10,67,11],[67,12,67,13],[68,7,68,9],[68,10,68,11],[68,12,68,13],[69,7,69,9],[69,10,69,11],[69,12,69,13],[70,7,70,9],[70,10,70,11],[70,12,70,13],[71,7,71,9],[71,10,71,11],[71,12,71,13],[72,7,72,9],[72,10,72,11],[72,12,72,13],[73,7,73,9],[73,10,73,11],[73,12,73,13],[74,7,74,9],[74,10,74,11],[74,12,74,13],[75,7,75,9],[75,10,75,11],[75,12,75,13],[76,7,76,9],[76,10,76,11],[76,12,76,13],[77,7,77,9],[77,10,77,11],[77,12,77,13],[78,7,78,9],[78,10,78,11],[78,12,78,13],[79,7,79,9],[79,10,79,11],[79,12,79,13],[80,7,80,9],[80,10,80,11],[80,12,80,13],[81,7,81,9],[81,10,81,11],[81,12,81,13],[84,7,84,9],[84,10,84,11],[84,12,84,13],[82,7,82,9],[82,10,82,11],[82,12,82,13],[83,7,83,9],[83,10,83,11],[83,12,83,13]]}
[null,null,null,null,null,"C1.0","C1.1.0",null,null,"C1.1.1.0",null,null,"C1.2.0",null,null,null,"C2.0",null,null,null,null,"C3.0",null,null,null,null,null,null,null,null,null,"EOL"]
[null,"手順書　＞　人口"]
[]
[null,null,null,"手順１"]
[]
[]
[]
[]
{"$rows_left_out":110}
{"sheet":"自動生成_市町村なまえ","index":6,"n_rows":39,"n_cols":71,"rows_kept":39,"cut":false,"hidden":false,"merged":[[11,54,11,57],[11,58,11,61],[11,62,11,65],[11,66,11,69],[12,54,12,57],[12,58,12,61],[12,62,12,65],[12,66,12,69],[6,67,6,69],[7,66,7,69],[8,66,8,69],[9,66,9,69],[10,55,10,57],[10,59,10,61],[10,63,10,65],[10,67,10,69],[13,54,13,57],[13,58,13,61],[13,62,13,65],[13,66,13,69],[14,19,14,21],[14,23,14,25],[14,31,14,33],[14,35,14,37],[14,39,14,41],[14,43,14,45],[14,55,14,57],[14,59,14,61],[14,63,14,65],[14,67,14,69],[15,18,15,21],[15,22,15,25],[15,30,15,33],[15,34,15,37],[15,38,15,41],[15,42,15,45],[15,54,15,57],[15,58,15,61],[15,62,15,65],[15,66,15,69],[16,18,16,21],[16,22,16,25],[16,30,16,33],[16,34,16,37],[16,38,16,41],[16,42,16,45],[16,54,16,57],[16,58,16,61],[16,62,16,65],[16,66,16,69],[17,18,17,21],[17,22,17,25],[17,30,17,33],[17,34,17,37],[17,38,17,41],[17,42,17,45],[17,54,17,57],[17,58,17,61],[17,62,17,65],[17,66,17,69],[18,7,18,9],[18,11,18,13],[18,15,18,17],[18,19,18,21],[18,23,18,25],[18,27,18,29],[18,55,18,57],[18,59,18,61],[18,63,18,65],[19,6,19,9],[19,10,19,13],[19,14,19,17],[19,18,19,21],[19,22,19,25],[19,26,19,29],[19,30,19,33],[18,31,18,33],[18,35,18,37],[18,39,18,41],[18,43,18,45],[18,47,18,49],[18,51,18,53],[19,58,19,61],[19,62,19,65],[20,6,20,9],[20,10,20,13],[20,14,20,17],[20,18,20,21],[20,22,20,25],[20,26,20,29],[20,30,20,33],[20,34,20,37],[19,34,19,37],[19,38,19,41],[19,42,19,45],[19,46,19,49],[19,50,19,53],[19,54,19,57],[21,42,21,45],[21,46,21,49],[21,50,21,53],[21,54,21,57],[21,58,21,61],[21,62,21,65],[20,62,20,65],[21,6,21,9],[21,10,21,13],[21,14,21,17],[21,18,21,21],[21,22,21,25],[21,26,21,29],[21,30,21,33],[21,34,21,37],[21,38,21,41],[20,38,20,41],[20,42,20,45],[20,46,20,49],[20,50,20,53],[20,54,20,57],[20,58,20,61],[23,18,23,21],[23,22,23,25],[23,30,23,33],[22,7,22,9],[22,11,22,13],[22,19,22,21],[22,23,22,25],[22,31,22,33],[22,39,22,41],[23,38,23,41],[23,42,23,45],[23,46,23,49],[23,50,23,53],[23,54,23,57],[23,58,23,61],[22,43,22,45],[22,47,22,49],[22,51,22,53],[22,55,22,57],[22,59,22,61],[25,18,25,21],[25,22,25,25],[25,30,25,33],[24,6,24,9],[24,10,24,13],[24,18,24,21],[24,22,24,25],[24,30,24,33],[24,38,24,41],[25,38,25,41],[25,42,25,45],[25,46,25,49],[25,50,25,53],[25,54,25,57],[25,58,25,61],[24,42,24,45],[24,46,24,49],[24,50,24,53],[24,54,24,57],[24,58,24,61],[28,18,28,21],[28,22,28,25],[29,6,29,9],[29,10,29,13],[29,18,29,21],[29,22,29,25],[26,7,26,9],[26,11,26,13],[26,19,26,21],[26,23,26,25],[27,6,27,9],[27,10,27,13],[27,18,27,21],[27,22,27,25],[33,6,33,9],[33,10,33,13],[2,3,2,5],[3,2,3,5],[4,2,4,5],[5,2,5,5],[30,7,30,9],[30,11,30,13],[31,6,31,9],[31,10,31,13],[32,6,32,9],[32,10,32,13],[28,6,28,9],[28,10,28,13],[25,6,25,9],[25,10,25,13],[23,6,23,9],[23,10,23,13]]}
[]
[]
[null,null,null,"名前",null,null,"あ",null,null,null,"い",null,null,null,"う",null,null,null,"え",null,null,null,"お",null,null,null,"か",null,null,null,"き",null,null,null,"く",null,null,null,"け",null,null,null,"こ",null,null,null,"さ",null,null,null,"し",null,null,null,"す",null,null,null,"せ",null,null,null,"そ",null,null,null,"た",null,null,null,"ち"]
[null,null,"なまえ"]
[]
[]
[null,null,"A",null,null,null,null,null,null,null,null,null,null,null,null,null,null,null,null,null,null,null,null,null,null,null,null,null,null,null,null,null,null,null,null,null,null,null,null,null,null,null,null,null,null,null,null,null,null,null,null,null,null,null,null,null,null,null,null,null,null,null,null,null,null,null,1,{"$f":"VLOOKUP(BO7,市町村データ!A2:AX48,MATCH(手順書_市町村なまえ!$H$52, 市町村データ!A1:AX1, 0),FALSE)","v":"北海道"}]
[null,null,null,null,null,null,null,null,null,null,null,null,null,null,null,null,null,null,null,null,null,null,null,null,null,null,null,null,null,null,null,null,null,null,null,null,null,null,null,null,null,null,null,null,null,null,null,null,null,null,null,null,null,null,null,null,null,null,null,null,null,null,null,null,null,null,{"$f":"VLOOKUP(BO7,市町村データ!A2:AX48,MATCH(手順書_市町村なまえ!$G$53, 市町村データ!A1:AX1, 0),FALSE)","v":"ほっかいどう"}]
{"$rows_left_out":32}
{"sheet":"手順書_人口密度","index":7,"n_rows":136,"n_cols":32,"rows_kept":136,"cut":false,"hidden":false,"merged":[[86,16,86,19],[83,16,83,17],[103,7,103,9],[103,10,103,11],[103,12,103,13],[101,7,101,9],[101,10,101,11],[101,12,101,13],[102,7,102,9],[102,10,102,11],[102,12,102,13],[99,7,99,9],[99,10,99,11],[99,12,99,13],[100,7,100,9],[100,10,100,11],[100,12,100,13],[97,7,97,9],[97,10,97,11],[97,12,97,13],[98,7,98,9],[98,10,98,11],[98,12,98,13],[95,7,95,9],[95,10,95,11],[95,12,95,13],[96,7,96,9],[96,10,96,11],[96,12,96,13],[93,7,93,9],[93,10,93,11],[93,12,93,13],[94,7,94,9],[94,10,94,11],[94,12,94,13],[91,7,91,9],[91,10,91,11],[91,12,91,13],[92,7,92,9],[92,10,92,11],[92,12,92,13],[89,7,89,9],[89,10,89,11],[89,12,89,13],[90,7,90,9],[90,10,90,11],[90,12,90,13],[87,7,87,9],[87,10,87,11],[87,12,87,13],[88,7,88,9],[88,10,88,11],[88,12,88,13],[85,7,85,9],[85,10,85,11],[85,12,85,13],[86,7,86,9],[86,10,86,11],[86,12,86,13],[83,7,83,9],[83,10,83,11],[83,12,83,13],[84,7,84,9],[84,10,84,11],[84,12,84,13],[30,16,30,17],[54,6,54,9],[15,5,15,14],[30,5,30,14],[51,7,51,9],[52,6,52,9],[53,6,53,9],[15,16,15,19]]}
[null,null,null,null,null,"C1.0","C1.1.0",null,null,"C1.1.1.0",null,null,"C1.2.0",null,null,null,"C2.0",null,null,null,null,"C3.0",null,null,null,null,null,null,null,null,null,"EOL"]
[null,"手順書　＞　人口"]
[]
[null,null,null,"手順１"]
[]
[]
[]
[]
{"$rows_left_out":129}
{"sheet":"自動生成_人口密度","index":8,"n_rows":39,"n_cols":77,"rows_kept":39,"cut":false,"hidden":false,"merged":[[15,73,15,75],[15,76,15,77],[16,73,16,75],[16,76,16,77],[17,73,17,75],[17,76,17,77],[12,73,12,75],[12,76,12,77],[13,73,13,75],[13,76,13,77],[14,73,14,75],[14,76,14,77],[9,73,9,75],[9,76,9,77],[10,73,10,75],[10,76,10,77],[11,73,11,75],[11,76,11,77],[6,73,6,75],[6,76,6,77],[7,73,7,75],[7,76,7,77],[8,73,8,75],[8,76,8,77],[33,6,33,9],[33,10,33,13],[2,3,2,5],[3,2,3,5],[4,2,4,5],[5,2,5,5],[30,7,30,9],[30,11,30,13],[31,6,31,9],[31,10,31,13],[32,6,32,9],[32,10,32,13],[28,6,28,9],[28,10,28,13],[28,18,28,21],[28,22,28,25],[29,6,29,9],[29,10,29,13],[29,18,29,21],[29,22,29,25],[26,7,26,9],[26,11,26,13],[26,19,26,21],[26,23,26,25],[27,6,27,9],[27,10,27,13],[27,18,27,21],[27,22,27,25],[25,38,25,41],[25,42,25,45],[25,46,25,49],[25,50,25,53],[25,54,25,57],[25,58,25,61],[24,42,24,45],[24,46,24,49],[24,50,24,53],[24,54,24,57],[24,58,24,61],[25,6,25,9],[25,10,25,13],[25,18,25,21],[25,22,25,25],[25,30,25,33],[24,6,24,9],[24,10,24,13],[24,18,24,21],[24,22,24,25],[24,30,24,33],[24,38,24,41],[23,38,23,41],[23,42,23,45],[23,46,23,49],[23,50,23,53],[23,54,23,57],[23,58,23,61],[22,43,22,45],[22,47,22,49],[22,51,22,53],[22,55,22,57],[22,59,22,61],[23,6,23,9],[23,10,23,13],[23,18,23,21],[23,22,23,25],[23,30,23,33],[22,7,22,9],[22,11,22,13],[22,19,22,21],[22,23,22,25],[22,31,22,33],[22,39,22,41],[21,42,21,45],[21,46,21,49],[21,50,21,53],[21,54,21,57],[21,58,21,61],[21,62,21,65],[20,62,20,65],[21,6,21,9],[21,10,21,13],[21,14,21,17],[21,18,21,21],[21,22,21,25],[21,26,21,29],[21,30,21,33],[21,34,21,37],[21,38,21,41],[20,38,20,41],[20,42,20,45],[20,46,20,49],[20,50,20,53],[20,54,20,57],[20,58,20,61],[19,58,19,61],[19,62,19,65],[20,6,20,9],[20,10,20,13],[20,14,20,17],[20,18,20,21],[20,22,20,25],[20,26,20,29],[20,30,20,33],[20,34,20,37],[19,34,19,37],[19,38,19,41],[19,42,19,45],[19,46,19,49],[19,50,19,53],[19,54,19,57],[18,55,18,57],[18,59,18,61],[18,63,18,65],[19,6,19,9],[19,10,19,13],[19,14,19,17],[19,18,19,21],[19,22,19,25],[19,26,19,29],[19,30,19,33],[18,31,18,33],[18,35,18,37],[18,39,18,41],[18,43,18,45],[18,47,18,49],[18,51,18,53],[17,54,17,57],[17,58,17,61],[17,62,17,65],[17,66,17,69],[18,7,18,9],[18,11,18,13],[18,15,18,17],[18,19,18,21],[18,23,18,25],[18,27,18,29],[16,54,16,57],[16,58,16,61],[16,62,16,65],[16,66,16,69],[17,18,17,21],[17,22,17,25],[17,30,17,33],[17,34,17,37],[17,38,17,41],[17,42,17,45],[15,54,15,57],[15,58,15,61],[15,62,15,65],[15,66,15,69],[16,18,16,21],[16,22,16,25],[16,30,16,33],[16,34,16,37],[16,38,16,41],[16,42,16,45],[14,55,14,57],[14,59,14,61],[14,63,14,65],[14,67,14,69],[15,18,15,21],[15,22,15,25],[15,30,15,33],[15,34,15,37],[15,38,15,41],[15,42,15,45],[13,54,13,57],[13,58,13,61],[13,62,13,65],[13,66,13,69],[14,19,14,21],[14,23,14,25],[14,31,14,33],[14,35,14,37],[14,39,14,41],[14,43,14,45],[11,54,11,57],[11,58,11,61],[11,62,11,65],[11,66,11,69],[12,54,12,57],[12,58,12,61],[12,62,12,65],[12,66,12,69],[6,67,6,69],[7,66,7,69],[8,66,8,69],[9,66,9,69],[10,55,10,57],[10,59,10,61],[10,63,10,65],[10,67,10,69]]}
[]
[]
[null,null,null,"名前",null,null,"あ",null,null,null,"い",null,null,null,"う",null,null,null,"え",null,null,null,"お",null,null,null,"か",null,null,null,"き",null,null,null,"く",null,null,null,"け",null,null,null,"こ",null,null,null,"さ",null,null,null,"し",null,null,null,"す",null,null,null,"せ",null,null,null,"そ",null,null,null,"た",null,null,null,"ち"]
[null,null,"人口密度（人/km2）"]
[null,null,"人口（人）"]
[null,null,"面積（km2）"]
[null,null,"A",null,null,null,null,null,null,null,null,null,null,null,null,null,null,null,null,null,null,null,null,null,null,null,null,null,null,null,null,null,null,null,null,null,null,null,null,null,null,null,null,null,null,null,null,null,null,null,null,null,null,null,null,null,null,null,null,null,null,null,null,null,null,null,1,{"$f":"VLOOKUP(BO7,市町村データ!A2:AX48,MATCH(手順書_人口密度!$H$52, 市町村データ!A1:AX1, 0),FALSE)","v":"北海道"},null,null,null,null,null,"以上",null,null,"背景色"]
[null,null,null,null,null,null,null,null,null,null,null,null,null,null,null,null,null,null,null,null,null,null,null,null,null,null,null,null,null,null,null,null,null,null,null,null,null,null,null,null,null,null,null,null,null,null,null,null,null,null,null,null,null,null,null,null,null,null,null,null,null,null,null,null,null,null,{"$f":"VLOOKUP(BO7,市町村データ!A2:AX48,MATCH(手順書_人口密度!$G$53, 市町村データ!A1:AX1, 0),FALSE)","v":66.599999999999994},null,null,null,null,null,null,5000]
{"$rows_left_out":32}
{"sheet":"手順書_人口","index":9,"n_rows":136,"n_cols":32,"rows_kept":136,"cut":false,"hidden":false,"merged":[[103,7,103,9],[103,10,103,11],[83,7,83,9],[85,7,85,9],[86,7,86,9],[87,7,87,9],[88,7,88,9],[89,7,89,9],[90,7,90,9],[91,7,91,9],[92,7,92,9],[93,7,93,9],[94,7,94,9],[95,7,95,9],[96,7,96,9],[99,7,99,9],[93,12,93,13],[94,12,94,13],[95,12,95,13],[90,12,90,13],[91,12,91,13],[92,12,92,13],[100,7,100,9],[101,7,101,9],[97,7,97,9],[98,7,98,9],[102,7,102,9],[103,12,103,13],[85,10,85,11],[86,10,86,11],[87,10,87,11],[90,10,90,11],[93,10,93,11],[89,10,89,11],[88,10,88,11],[86,12,86,13],[85,12,85,13],[99,12,99,13],[100,12,100,13],[101,12,101,13],[96,12,96,13],[97,12,97,13],[98,12,98,13],[86,16,86,19],[87,12,87,13],[88,12,88,13],[99,10,99,11],[102,10,102,11],[92,10,92,11],[91,10,91,11],[101,10,101,11],[100,10,100,11],[95,10,95,11],[94,10,94,11],[98,10,98,11],[97,10,97,11],[96,10,96,11],[89,12,89,13],[102,12,102,13],[30,16,30,17],[84,7,84,9],[15,5,15,14],[51,7,51,9],[52,6,52,9],[53,6,53,9],[54,6,54,9],[30,5,30,14],[84,12,84,13],[83,12,83,13],[83,10,83,11],[84,10,84,11],[15,16,15,19],[83,16,83,17]]}
[null,null,null,null,null,"C1.0","C1.1.0",null,null,"C1.1.1.0",null,null,"C1.2.0",null,null,null,"C2.0",null,null,null,null,"C3.0",null,null,null,null,null,null,null,null,null,"EOL"]
[null,"手順書　＞　人口"]
[]
[null,null,null,"手順１"]
[]
[]
[]
[]
{"$rows_left_out":129}
{"sheet":"自動生成_人口","index":10,"n_rows":39,"n_cols":77,"rows_kept":39,"cut":false,"hidden":false,"merged":[[15,73,15,75],[15,76,15,77],[16,73,16,75],[16,76,16,77],[17,73,17,75],[17,76,17,77],[12,73,12,75],[12,76,12,77],[13,73,13,75],[13,76,13,77],[14,73,14,75],[14,76,14,77],[9,73,9,75],[9,76,9,77],[10,73,10,75],[10,76,10,77],[11,73,11,75],[11,76,11,77],[6,73,6,75],[6,76,6,77],[7,73,7,75],[7,76,7,77],[8,73,8,75],[8,76,8,77],[33,6,33,9],[33,10,33,13],[2,3,2,5],[3,2,3,5],[4,2,4,5],[5,2,5,5],[30,7,30,9],[30,11,30,13],[31,6,31,9],[31,10,31,13],[32,6,32,9],[32,10,32,13],[28,6,28,9],[28,10,28,13],[28,18,28,21],[28,22,28,25],[29,6,29,9],[29,10,29,13],[29,18,29,21],[29,22,29,25],[26,7,26,9],[26,11,26,13],[26,19,26,21],[26,23,26,25],[27,6,27,9],[27,10,27,13],[27,18,27,21],[27,22,27,25],[25,38,25,41],[25,42,25,45],[25,46,25,49],[25,50,25,53],[25,54,25,57],[25,58,25,61],[24,42,24,45],[24,46,24,49],[24,50,24,53],[24,54,24,57],[24,58,24,61],[25,6,25,9],[25,10,25,13],[25,18,25,21],[25,22,25,25],[25,30,25,33],[24,6,24,9],[24,10,24,13],[24,18,24,21],[24,22,24,25],[24,30,24,33],[24,38,24,41],[23,38,23,41],[23,42,23,45],[23,46,23,49],[23,50,23,53],[23,54,23,57],[23,58,23,61],[22,43,22,45],[22,47,22,49],[22,51,22,53],[22,55,22,57],[22,59,22,61],[23,6,23,9],[23,10,23,13],[23,18,23,21],[23,22,23,25],[23,30,23,33],[22,7,22,9],[22,11,22,13],[22,19,22,21],[22,23,22,25],[22,31,22,33],[22,39,22,41],[21,42,21,45],[21,46,21,49],[21,50,21,53],[21,54,21,57],[21,58,21,61],[21,62,21,65],[20,62,20,65],[21,6,21,9],[21,10,21,13],[21,14,21,17],[21,18,21,21],[21,22,21,25],[21,26,21,29],[21,30,21,33],[21,34,21,37],[21,38,21,41],[20,38,20,41],[20,42,20,45],[20,46,20,49],[20,50,20,53],[20,54,20,57],[20,58,20,61],[19,58,19,61],[19,62,19,65],[20,6,20,9],[20,10,20,13],[20,14,20,17],[20,18,20,21],[20,22,20,25],[20,26,20,29],[20,30,20,33],[20,34,20,37],[19,34,19,37],[19,38,19,41],[19,42,19,45],[19,46,19,49],[19,50,19,53],[19,54,19,57],[18,55,18,57],[18,59,18,61],[18,63,18,65],[19,6,19,9],[19,10,19,13],[19,14,19,17],[19,18,19,21],[19,22,19,25],[19,26,19,29],[19,30,19,33],[18,31,18,33],[18,35,18,37],[18,39,18,41],[18,43,18,45],[18,47,18,49],[18,51,18,53],[17,54,17,57],[17,58,17,61],[17,62,17,65],[17,66,17,69],[18,7,18,9],[18,11,18,13],[18,15,18,17],[18,19,18,21],[18,23,18,25],[18,27,18,29],[16,54,16,57],[16,58,16,61],[16,62,16,65],[16,66,16,69],[17,18,17,21],[17,22,17,25],[17,30,17,33],[17,34,17,37],[17,38,17,41],[17,42,17,45],[15,54,15,57],[15,58,15,61],[15,62,15,65],[15,66,15,69],[16,18,16,21],[16,22,16,25],[16,30,16,33],[16,34,16,37],[16,38,16,41],[16,42,16,45],[14,55,14,57],[14,59,14,61],[14,63,14,65],[14,67,14,69],[15,18,15,21],[15,22,15,25],[15,30,15,33],[15,34,15,37],[15,38,15,41],[15,42,15,45],[13,54,13,57],[13,58,13,61],[13,62,13,65],[13,66,13,69],[14,19,14,21],[14,23,14,25],[14,31,14,33],[14,35,14,37],[14,39,14,41],[14,43,14,45],[11,54,11,57],[11,58,11,61],[11,62,11,65],[11,66,11,69],[12,54,12,57],[12,58,12,61],[12,62,12,65],[12,66,12,69],[6,67,6,69],[7,66,7,69],[8,66,8,69],[9,66,9,69],[10,55,10,57],[10,59,10,61],[10,63,10,65],[10,67,10,69]]}
[]
[]
[null,null,null,"名前",null,null,"あ",null,null,null,"い",null,null,null,"う",null,null,null,"え",null,null,null,"お",null,null,null,"か",null,null,null,"き",null,null,null,"く",null,null,null,"け",null,null,null,"こ",null,null,null,"さ",null,null,null,"し",null,null,null,"す",null,null,null,"せ",null,null,null,"そ",null,null,null,"た",null,null,null,"ち"]
[null,null,"人口密度（人/km2）"]
[null,null,"人口（人）"]
[null,null,"面積（km2）"]
[null,null,"A",null,null,null,null,null,null,null,null,null,null,null,null,null,null,null,null,null,null,null,null,null,null,null,null,null,null,null,null,null,null,null,null,null,null,null,null,null,null,null,null,null,null,null,null,null,null,null,null,null,null,null,null,null,null,null,null,null,null,null,null,null,null,null,1,{"$f":"VLOOKUP(BO7,市町村データ!A2:AX48,MATCH(手順書_人口!$H$52, 市町村データ!A1:AX1, 0),FALSE)","v":"北海道"},null,null,null,null,null,"以上",null,null,"背景色"]
[null,null,null,null,null,null,null,null,null,null,null,null,null,null,null,null,null,null,null,null,null,null,null,null,null,null,null,null,null,null,null,null,null,null,null,null,null,null,null,null,null,null,null,null,null,null,null,null,null,null,null,null,null,null,null,null,null,null,null,null,null,null,null,null,null,null,{"$f":"VLOOKUP(BO7,市町村データ!A2:AX48,MATCH(手順書_人口!$G$53, 市町村データ!A1:AX1, 0),FALSE)","v":66.599999999999994},null,null,null,null,null,null,10000000]
{"$rows_left_out":31}